unable to start webdriveragent session because of xcodebuild failure V010. Unable to launch WebDriverAgent because of xcodebuild failure: "Carthage binary is not found. ssh/known_hosts file. quitAndUninstall$ (. py failed to execute:", compiler: 203: print >> sys. app” couldn’t be opened because there is no such file. freedesktop. GitHub Gist: instantly share code, notes, and snippets. 7 which should be the case for a stock Mac OSX 10. 很奇怪,不是程序的问题,因为我把程序改得完全错误,再按run它还是跳出来这个. The certificate affects the limitation ( issue ) Documentation built with MkDocs . 2xlarge] is not in [t2. 04 Start the VM Point the VM to a valid ISO of either Windows 7 or Ubuntu. Still, I cloned it from GitHub and managed to install it via command line and XCodeBuild with some help from internet, but when I failed to start process with commandline 'dotnet . "相关问题答案,如果想了解更多关于Not able to start appium-desktop: "The file “WebDriverAgentRunner-Runner. /Scripts/bootstrap. app/Contents/Eclipse/configuration/resources/tools/imobiledevice idevice_id -l. If it cannot installed , check the connection , see if you can create and compile a “Hello World” with Xcode in the simulator. micro,t3. The commands below use the Terminal - you type what's after the $ - and they assume you have a working Python 2. (Underlying error: The executable was signed with invalid entitlements. In Xcode, the Configurations section of your project's Info pane provides a pop-up menu, which sets the default configuration to be used by xcodebuild when building a target. Failed to install . Real device security settings On some systems there are Accessibility restrictions that make the WebDriverAgent system unable to run. com/appium/appium-xcuitest-driver/blob/master/docs/real-device-config. 2015-10-09 12:16:39. micro] for [InstanceType] Number of failures: 2 Note: To demonstrate the above functionality I changed my CloudFormation template to use unencrypted EBS volume and switched the EC2 instance type to t3. The VM session was aborted. apple. MX Direct allows you to send email from this Comet Server without needing to configure a custom SMTP server. Online Help Keyboard Shortcuts Feed Builder What’s new So I will start with the Appium tool that I am trying to setup for mobile automation and I took close to 2 days to get it setup correctly. 5 and only for Katalon Studio Enterprise users). Developer tools must be installed, the XCode license must be accepted, andyour active XCode command line tools directory must point to an installedversion of XCode. Start a session to inspect the elements. plist is loaded! When executing xcodebuild -exportArchive through an ssh session, it failed with a segmentation fault. Original error: Unable to launch WebDriverAgent because of xcodebuild failure: “Carthage binary is not found. make it perfect ! Solution: This Error is most commonly caused when the browser session doesn't start in defined time and the request gets timed out i. . This should also auto select Signing Ceritificate. By default, this driver will create a new iOS simulator and run tests on it, deleting the simulator afterward. To use free version of PVS-Studio, source code files are required to start with a special comment. After that you can quit Xcode. I will try to post the issues I faced and the solutions – Issue – Unable to launch WebDriverAgent because of xcodebuild failure: “Carthage binary is not found”. The window that states finding software actually had another window hidden > sudo xcode-select --switch /Applications/Xcode. Opening the appium inspector from GUI. Unable to start WebDriverAgent session because of xcodebuild failure: "Could not proxy command to remote server #9741 The problem. 332 xcodebuild[3698:54840] Started session with 00008020-00140D5A3686002E Unable to create a new remote session. Start VirtualBox; Create a 32-bit or 64-bit VM to install Windows 7 or Ubuntu 12. I've tryed to make a custom Fake Factory for 'Usuario' model (but i've problems because my 'Usuario' model isn't a Eloquent Model. xcodebuild error message: Complete Error message: [MJSONWP] Encountered internal error running command: Error: Unable to start WebDriverAgent session because of xcodebuild failure: "Could not proxy command to remote server. Prerequisites: selenium locators locator tool : UIAutomatorViewer or Appium UI inspector To know how to identify the mobile apps for both Android & iOS Selenium locators are applicable for Appium as well,… [HttpException (0x80004005): Unable to connect to SQL Server session database. 96. 0' end Troubleshooting Failed to determine hittability of Button Failed to determine hittability of Button: Unable to fetch parameterized attribute XC Selenium commands commonly fail when there are certain visibility issues or because the DOM did not load completely during an AJAX request. Check if your device is recognized using the following commands on Terminal. In this tutorial, W have worked with the existing “Contact” app in the Simulator. This API is better The server is disabled by setting the environment variable R_DISABLE_HTTPD to a non-empty value, either before R is started or within the R session before HTML help (including help. 0. 6 and higher. You can close Xcode directly afterwards. ssh/known_hostsfile. codesign -dvv returns Identifier=com. More comprehensive testing can be done by make check-devel or make check-all see file tests/README. dtdevicekit Code: 811 Recovery Suggestion: Please check your connection to your device. /LetsChat. 点击右上角的搜索icon,启动一个session。 session启动后出现如图所示的编辑页面。 (3). app” couldn’t be opened because there is no such file. Summary: The WDA bundled along with the agent does not work on Xcode version 11. java, and Appium 1. appium server-side error: xcodebuild failed with code 65. i have tried chrome, IE, and firefox. By default, this driver will create a new iOS simulator and run tests on it, deleting the simulator afterward. 60]: $ xcodebuild -list -workspace . If you now connect to your device from expecco, the WebDriverAgent will be installed and started on it and then switch to the app to be tested. Original error: Unable to Before module version 2. Lower the RAM size of Intel HAXM. I will try to post the issues I faced and the solutions – Issue – Unable to launch WebDriverAgent because of xcodebuild failure: “Carthage binary is not found”. If not please try to go to that folder (webdriverAgent) and then run the xcode first and then go to terminal and run the command from where the WebdriverAgent is located. Because a Cordova app is a web app, this means you use standard web elements to create your user interface instead of relying on platform-specific native UI components. Unable to launch WebDriverAgent because of xcodebuild failure: xcodebuild failed with code 65 . txt. print >> sys. sh run). Advanced Topics - Facebook SDK for iOS, by navigating to the file in Finder, right-clicking the file, and clicking Compress. Most of times, if you have setup ios for appium tests, you might get error “Unable to launch WebDriverAgent because of xcodebuild failure: not found: carthage” while. path. xcodebuild -project WebDriverAgent. Use this pop-up menu to select a default build configuration for xcodebuild as seen in Figure 2. Figure 2-4. Unable to launch WebDriverAgent because of xcodebuild failure: xcodebuild failed with code 65 Unable to launch WebDriverAgent because of xcodebuild failure: "xcodebuild failed with code 65". In case you get an error “Unable to launch WebDriverAgent because of xcodebuild failure: xcodebuild failed with code 65 xcodebuild error message I am also facing the issue " Unable to launch WebDriverAgent because of xcodebuild failure: "xcodebuild failed with code 65". 很奇怪,不是程序的问题,因为我把程序改得完全错误,再按run它还是跳出来这个. Please follow the below image for the required desired capabilities and start the session. test. [35m[XCUITest] [39m at asyncHandler (/usr/local/lib/node_modules/appium/node_modules/appium-base-driver/lib/protocol/protocol. WebDriverException: Unable to launch the app: Error: Trying to start logcat capture but it's already started! )错误解决办法; Xcode: Unable to open project… cannot be opened because the project file cannot be parsed; Unable to resolve target &#39;Google Inc. Could not start session. (50686014)Workaround: SSH into the host and verify the fingerprint from the command line before using xcodebuild, or manually add the host fingerprint to the ~/. If you have a lot, this might take a while\r [18:03:37]: You can disable IAP checking by setting the `include_in_app_purchases` flag to `false`\r [18:03:38]: Done reading in-app purchases\r [18:03:38]: Passed: No negative sentiment\r [18:03:38]: Passed: No placeholder text\r [18:03:38]: Passed: No mentioning competitors\r [18:03:38 Albeit experiencing these errors, executing a pod install, pod update and running the app from both the Xcode play, Android studio play button and ‘flutter run’ allow the app to run correctly on device. xcodeproj' does not exist, xcodebuild failed with code 65 Original error: Unable to launch WebDriverAgent because of xcodebuild failure: "xcodebuild failed with code 65". Go to Settings -> Developer > turn ON UIAutomation. After the download and installation completes, you will need to accept the license agreement. - appium hot 38 xcodebuild -project WebDriverAgent. 问题汇总 carthage Error: Unable to launch WebDriverAgent because of xcodebuild failure: not found: carthage 需要安装carthage brew install carthage. If you want to open more that one session at a time, you have a few options: You can create a new window (Shell > New Window), you can create a new tab (Shell > New Tab), or you can split the current session into two panes (Shell > Split Horizontally, Shell > Split Vertically), each of which is a Original error: Unable to launch WebDriverAgent because of xcodebuild failure: "xcodebuild failed with code 65". python. 编辑需要的属性。 View license def main(): # Create our client. A failure in tests/ok-errors. 00s Set Up To completely verify, you can try accessing the WebDriverAgent server status (note: you must be on the same network as the device, and know its IP address, from Settings => Wi-Fi => Current Network): [XCUITest] xcodebuild exited with code '70' and signal 'null' [debug] [BaseDriver] Event 'wdaStartFailed' logged at 1514424158353 (09:22:38 GMT+0800 (CST)) [debug] [XCUITest] Unable to launch WebDriverAgent because of xcodebuild failure: "xcodebuild failed with code 70". apple. xcodeproj -scheme WebDriverAgentRunner -destination id='<udid>' test. New: Updated Linux to now use C locale like all other UE platforms. :Google APIs和Open the Java build path property page of print >> sys. xcodebuildがコード65で失敗したため、WebDriverAgentを起動できません 実際のiOSデバイスでAppiumを実行しようとしています。 Androidで正常に実行できましたが、iOSで実行しようとするとエラーが発生します。 Unable to Start a Session on MOS or Mobile Recorder on Xcode version 11. Double click and open XCode project: WebDriverAgent. Issue #484 Use SwiftMonkey which adds random UITests gestures Add to UITests target target 'MyAppUITests' do pod 'R. It does not recognize the single quote when copied and pasted. rest_client = client_module. 96. If the command configure and make commands execute successfully, a shell-script front-end called R will be created and copied to R_HOME /bin. fails because xcodebuild can't reach the keys on the That’s it. 6 or higher. ] [Answered] RSS 1 reply Last post Sep 10, 2008 02:35 AM by Jian Kang - MSFT [BaseDriver] Session created with session id: 43ecd84d-7836-47fb-87ff-37614d54ddd6 Hit enter to search. ) Start Firefox > 3. This should also auto select Signing Ceritificate. Building trunk fails, tho, no matter whether I use make(1) or Xcode: % make xcodebuild -alltargets -configuration Development && \ chmod -R go+rX build/Development === BUILD NATIVE TARGET Growl OF PROJECT iTerm WITH CONFIGURATION Development === Check dependencies So we can actually use this to start an Appium session without referring to any real application in particular: capabilities. For more information, please see the "Failed email delivery with MX Direct" section in the Troubleshooting document. 0' pod 'SwiftMonkey', '~> 2. Configure Appium For iOS. 1 Xcode 5 on mavericks I couldn't install ios-sim via the refered way, most probably because I have zero experience with OSX. By default, Appium calls test-without-build after build-for-testing for WDA . apple. cd /Applications/Katalon\ Studio. A shortcut is to run sudo xcodebuild -license accept from the command line. Use direct analyzer integration or compiler monitoring instead. 3. Reboot required: no [HRESULT = 0x800f0922 - CBS_E_INSTALLERS_FAILED] Failed to FinalizeEx using worker session [HRESULT = 0x800f0922] Cause. The outcome should look as shown below: All of sudden starting a few weeks ago, ALL the users from another city (who uses remote desktop) is complaining that they are kicked off the session once or twice a day with the message "Because of a protocol error, this session will be disconnected". x machine. . Presence of #line directives may cause some Delete your ~/Library/Application Support/Firefox > 2. VirtualBox returns this error: Failed to open a session for the virtual machine Ubuntu 32-bit. com/appium/appium-xcuitest-driver/blob/master/docs/real-device-config. What’s the error –. After the download and installation completes, you will need to accept the license agreement. Please check the server log for more details. Unable to launch WebDriverAgent because of xcodebuild failure: xcodebuild failed with code 65 . Figure 2 Debug set as the default build configuration for xcodebuild. Original error: Unable to launch WebDriverAgent because of xcodebuild failure: Command 'carthage bootstrap --platform iOS\,tvOS' exited with code 1 i have installed carthage again and did everything but no luck. 6 or higher. 0. V011. apks (not apk) using Appium in C# on real android xcodebuild -project WebDriverAgent. ) Close Firefox > 4. xcodeproj Building for iOS, but the embedded framework &#39;YYCache. When this is working correctly, you can do what I did, which is run Tomcat interactively in a Terminal session (catalina. try to run the WebDriverAgentRunnerapp on the device, you will see a popup Error: Unable to launch WebDriverAgent because of xcodebuild failure: "Unable to start iproxy. 1. Tour Start here for a quick overview of the site Help Center Detailed answers to any questions you might have In our earlier posts Maven in eclipse – part1 and Maven in eclipse – part2, we have seen how to setup and use maven in eclipse. View license def main(): # Create our client. Unable to launch WebDriverAgent because of xcodebuild failure: "xcodebuild failed with code 65". Take A Sneak Peak At The Movies Coming Out This Week (8/12) These 11 Hollywood celebs spend the big bucks on PJs; Classic 90s movies that are still all the rage Unable to start the analysis on this file. Can you guys help me please. 3] WebDriverAgent. 00s Start Test at 2017-01-23 15:49:12. 重新启动appium server,然后再启动start new session . The session file used by the <cmsynergysessionmonitor> to persist your CM Synergy session information. xcodeproj -scheme WebDriverAgentRunner -destination 'id=' test; Now start appium on command line using “appium -p <PORT>” and throwing commands through your script. 73]: $ xcodebuild -showBuildSettings -workspace . 668 xcodebuild[85849:748584] [MT] IDETestOperationsObserverDebug: ((null)) Finished syncing device diagnostic logs after 0. (63158434)Workaround: Start up from macOS Recovery. /lib/driver. springboard”); On its own, however, this isn’t going to work, because Appium will try to launch this app, and deep in the XCUITest code related to app launching is some logic that [Task 1/12] Current/Best: 0. 3. So I will start with the Appium tool that I am trying to setup for mobile automation and I took close to 2 days to get it setup correctly. Expected Results: The app installs WebDriverAgent installs The app opens [Appium] Welcome to Appium v1. 最终解决的 版本就是修改appium,将其中带有的webdriveragent正确就可以了. Is it installed?". invoke [as _invoke] (/usr/local/lib/node_modules/appium/node_modules/babel-runtime/regenerator/runtime. ccmsessionmap" in your home directory. this is probably because cudnn failed to initialize, so try looking to see if a warning log message was printed above. Please comment for any kind of related queries. Original error: An unknown server-side error occurred while processing the command. start) is used. However, there is a greater chance of the email being discarded as spam. Original error: Could not proxy command to remote server. Original error: Error: socket hang up". As mentioned in prevois post selenium webdriver setup, hope you downloaded the Eclipse IDE and all required jar files. 2 Question: Background : I am trying to automate iOS app. Then on Xcode’s menu bar, select Product > Build; Repeat the last two steps for WebDriverAgentRunner as well. Please check the server log for more Unable to launch com. js:374:15) at tryCatch (/usr/local/lib/node_modules/appium/node_modules/babel-runtime/regenerator/runtime. springboard”); On its own, however, this isn’t going to work, because Appium will try to launch this app, and deep in the XCUITest code related to app launching is some logic that I want to distribute my application. You can try the following: Lower the RAM size in the memory options of the emulator. Typically, Appium uses xcodebuild under the hood to both build WebDriverAgent and kick off the XCUITest process that powers the test session. xcodebuild can run xcuitest process without building them. On the device, however, the execution of the WebDriverAgent must still be trusted. [EC2Instance] failed because [t3. 启动Appium Desktop,单击start。 (2). Failed to create WDA session. sh -d Open WebDriverAgent. Adding dynamic Classes to Exclusion list. dbus-session. 0') # Endpoints used in this sample scripts_endpoint = 'analytics/custom_actions/scripts' actions_endpoint = 'analytics/custom_actions/actions' # Variable to hold the root path to the custom actions sample folder root_path = os. 5 ; The server is disabled by setting the environment variable R_DISABLE_HTTPD to a non-empty value, either before R is started or within the R session before HTML help (including help. After the Appium installation you have to set a valid provisioning profile [Xcode] ** TEST EXECUTE FAILED ** [XCUITest] xcodebuild exited with code '65' and signal 'null' [debug] [XCUITest] Unable to launch WebDriverAgent because of xcodebuild failure: xcodebuild failed with code 65 [debug] [XCUITest] Quitting and uninstalling WebDriverAgent, then retrying [XCUITest] Shutting down sub-processes Build WebDriverAgent once to verify all above steps worked. "技术问题等相关问答,请访问CSDN问答。 Click Start Click the maginfing glass Naigate to saved capabilities Click start session. sh -d' exited with code 1 [XCUITest] Quitting and uninstalling WebDriverAgent, then retrying [XCUITest] Shutting down sub-processes [XCUITest] Removing WDA application from device Original error: Unable to launch WebDriverAgent because of xcodebuild failure: xcodebuild failed with code 65. [email protected] js:67:40) [XCUITest] Unable to launch WebDriverAgent because of xcodebuild failure: Command ‘Scripts/bootstrap. Please use the main Appium issue tracker instead. Source Control – When using xcodebuild, resolving packages may fail to verify SSH fingerprints unless that fingerprint is already in the ~/. bhati,. If your data volume is encrypted, use Disk Utility to mount it. Install using brew install carthage` if it is not installed and make sure the root folder, where carthage binary is installed, is present in PATH environment variable. WebDriverAgentRunner-Runner because it has an invalid code signature, inadequate entitlements or its profile has not been explicitly trusted by the user. realpath(__file__)) # Script file name & path to Get CMake, the dev environment, Android Studio and Xcode all setup and installed. ) Start firefox, after a couple of seconds - the never ending hang happens > Are we seeing this hang in any other situation than the above STR? During the mac meeting, I was under the impression the STR was a 刚刚装的eclipse,想运行一个简单的helloworld程序,居然跳出来这个unable to launch:The selection can not be launched,and there are no recent launches. I successfully sign it with my apple ID, and a profile. Child with pid 87094 exited normally 2015-10-09 12:16:39. I successfully sign it with my apple ID, and a profile. You can close Xcode directly afterwards. 1 Mac iOS Version : 10. New: We now provide the file path of the ICU DLL that failed to load. g. sh -d' exited with code 1error message in failing xcodebuild - Make surexcodebuild -checkFirstLaunchStatusreturns status code0- If it returns69, you should callxcodebuild -runFirstLaunchonce to prevent the root error,Install Started Install Failed: Error Domain=DVTDownloadableErrors Code=3 "The authorization was denied since no user interaction was possible. A workaround for this is to use a private key that is not stored on the system keychain. FreeBSD Bugzilla – Attachment 179719 Details for Bug 216797 [exp-run] update Qt to 5. stderr, e: 204: return "" 205: 206 +def GetVersionFromEnvironment(compiler_env): 207 + """ Returns the version of compiler: 208 + 209 + If the compiler was set by the given environment variable and exists, 210 + return its version, otherwise None is (org. xcworkspace -scheme DropDown\r WARN [2020-06-22 15:29:04. Unable to run xcode-select --install, can download the "Command Line Tools (macOS 10. MacPorts may be conceptually divided into two main parts: the infrastructure, known as MacPorts base, and the set of available ports. Changelog Compiler New Features KT-30222 Support JVM target version selection in Kotlin bytecode tool window; KT-41884 Support 'file' target for JvmSynthetic annotation; KT-44278 Generate SAM-converted lambdas and function references using 'invokedynamic' on JDK 1. 12 [macOS Sierra] Appium : 1. If you have a prebuilt WebDriverAgent binary and would like to save some time on startup, set the usePrebuiltWDA cap to true. Running the appium tests. If you’re seeing an issue related to the WebDriverAgent like the logs in the original post show, please make sure you follow the instructions here to build the WebDriverAgent project: 1. If you have a prebuilt WebDriverAgent binary and would like to save some time on startup, set the usePrebuiltWDA cap to true. 1, move Qt4 binaries and rename ports If you updated to macOS Big Sur 11 beta from a previous version of macOS, Software Update might show “Unable to check for updates – Failed to download the documentation for the minor update. For both the WebDriverAgentLib and WebDriverAgentRunner targets, select "Automatically manage signing" in the "General" tab, and then select your Development Team. start_session(capabilities, browser_profile) Original error: Unable to launch WebDriverAgent because of xcodebuild failure: xcodebuild failed with code 65 Unable to create a new remote session. Session. There are 2 options: true if you want to run failed test data execution; otherwise, false (available from version 7. Appium also has the ability. authorities, could not initialize proxy - no Session By: Duhu 2. Note: My project is using a UICollection view as the drop target, so I’m working with the methods in the UICollectionViewDropDelegate protocol. even installed appium Unable to launch WebDriverAgent because of xcodebuild failure: "xcodebuild failed with code 65". apple. What can I try? Thanks a lot!!! This error typically occurs after an XCode upgrade. Figure 2 Debug set as the default build configuration for xcodebuild. \\myapi. Original error: Error: socket hang up #12082 [MJSONWP] Encountered internal error running command: Error: Unable to launch WebDriverAgent because of xcodebuild failure: xcodebuild failed with code 65 at XCUITestDriver. rest_client = client_module. 成功之后启动 appium ,start inspector session,startSession Unable to launch WebDriverAgent because of xcodebuild failure: "xcodebuild failed with code 65". 0 WebDriverAgent component only supports XCode8 and newer Since module version 2. xcodeproj -scheme WebDriverAgentRunner -destination 'platform=iOS Simulator,name=iPhone 11' test This will check if WebDriverAgent can installed. Test target WebDriverAgentRunner encountered an error (Early unexpected exit, operation never finished bootstrapping - no restart will be attempted) The problem is that the developer is not trusted on the device. From Mac OS X 10. py failed to execute:", compiler: 203: print >> sys. 成功之后启动appium ,start inspector session,startSession。 Unable to launch WebDriverAgent because of xcodebuild failure: "xcodebuild failed with code 65". apple. x above devices. See full list on github. 0 WebDriverAgent component only supports XCode9 and newer Sim Resetting. The outcome should look as shown below: Connect your device to Xcode. xxxxx. It is also possible that system security measures will prevent the server from being started, for example if the loopback interface has been disabled. 15. WebDriverAgentRunner-Runner because it has an invalid code signature, inadequate entitlements or its profile has not been explicitly trusted by the user. Use this pop-up menu to select a default build configuration for xcodebuild as seen in Figure 2. ", while running a test case in iPhone device. 1. Actual: App is unable to run either in debugger or profiler mode. Make sure you follow the tutorial at https://github. Original error: Error: socket hang up". errors_impl. Please check your connection to your device. Update the existing Amazon EC2 IAM instance profile ( cicd_ec2_instance_profile ): Replace the S3 bucket name mywebapp-codepipeline-bucket-us-east-1-111111111111 with your S3 bucket name (the one used for the CodePipelineArtifactS3Bucket parameter @Guido: try messing with the baud rate settings – typically most devices will use 9600 bps, 8N1 (bps, parity, bits). xcodeproj -scheme WebDriverAgentRunner -destination 'platform=iOS Simulator,name=iPhone 11' test This will check if WebDriverAgent can installed. xxxxx. 588 t = 0. 1 [Appium] Non-default server args: Original error: Unable to start WebDriverAgent session because of xcodebuild failure: "Could not proxy command to remote server. Click the Start button to start mining and click Stop to stop mining, as shown in Figure 2-4. . xcworkspace\r INFO [2020-06-22 15:29:02. Make sure you follow the tutorial" Appium 遇到 Unable to launch WebDriverAgent because of xcodebuild failure: xcodebuild failed with code 65 的解决方法 安装依赖: Appium iOS真机测试依赖于中心第三方软件套件:libimobiledevice, 用homebrew很容易安装 An active Xcode/xcodebuild connection/session is necessary to interact with WebDriverAgentRunner because of Apple's security design. To use it, follow these steps: Pair Visual 2019 to a Mac Build host. If you have a manual for the device that you’re trying to console, it most likely has a section which describes how to access it via serial. If it cannot installed , check the connection , see if you can create and compile a “Hello World” with Xcode in the simulator. For both the WebDriverAgentLib and WebDriverAgentRunner targets, select "Automatically manage signing" in the "General" tab, and then select your Development Team. Continuous integration is the process of automating and streamlining the building, analyzing, testing, and archiving of your apps, in order to ensure that they are always in a releasable state. . . Original error: The JAVA_HOME environment variable must be set for Android Tools to work properly. Find the logs here LogsiOS. Original error: Could not proxy command to remote server. } `` * GetUnable to launch WebDriverAgent because of xcodebuild failure: Command 'Scripts/bootstrap. dirname(os. 13) for Xcode 9. 则表示WebDriverAgent安装及编译成功, 6、启动Appium Desktop,开始测试 (1). Note: If you are using Maven project to maintain your jar… Join Stack Overflow to learn, share knowledge, and build your career. sessionname: No: The session name of the CM Synergy session you wish to use. 1" from: Not being a Mac enthusiast, I went online to find some answers, but found none. If it is still not working then make sure you are not copying the command and paste it to terminal. Advanced. It can identify problems automatically for your iTunes, just like a professional iTunes online "doctor". com): \r \r Looking for related GitHub issues on fastlane xcodebuild -project WebDriverAgent. bundle . Unable to install and run iOS app on Simulator from command line - Simulator of iOS 6. 01]: Your Apple ID (e. [ Natty] java failed to lazily initialize a collection of role: User. unknownerror: failed to get convolution algorithm. At this point only solution to get the user up and running is either have the user initiate a restart of their virtual desktop, or have the helpdesk log the user off, or send a restart command to that virtual [HRESULT = 0x800f0922 - CBS_E_INSTALLERS_FAILED] Session: 30651968_3203616141 finalized. NOTE: we need not to download any of the jar file needed… Real iPhone automation using Appium . apple. Retry failed test data execution in test suite (this parameter overrides setting in test suite file). If you start Xcode for the first time, a dialog will pop up where you can read the license agreement and accept it. app encountered an error (Failed to install or launch the test runner. error: key does not contain section; connect ECONNREFUSED 127. 00 GFLOPS | Progress: (0/100) | 0. Before module version 2. We can use the 'Chrome Extension Settings' page for managing these attributes. 1:27017; failed to push some refs to So we can actually use this to start an Appium session without referring to any real application in particular: capabilities. Details Failed to start remote service "com. xcodeproj in Xcode. Solution: Perform the following steps: If the device, emulator, or Simulator is screen-locked when you start testing, and Silk Test Classic is unable to unlock the screen, the device, emulator, or Simulator might stop responding to any actions. Known issues. Create an alloy/classic app 2. This is because UIImage cannot import raw images directly, requiring a detour through Core Image. 96. js:67:40) at GeneratorFunctionPrototype. sh -d’ exited with code 1 [XCUITest] Quitting and uninstalling WebDriverAgent, then retrying [XCUITest] Shutting down sub-processes [XCUITest] Removing WDA application from device Windows Server 2012 no longer allows interactive services, by default, which makes the Interactive Services Detection service unnecessary. To mitigate this issue, we have introduced NLPs that uses a JavaScriptExecutor. setCapability(“app”, “com. mkdir -p Resources/WebDriverAgent. 8+ Have fun! \r INFO [2020-06-22 15:29:00. 535Z WARN webdriver: Request failed due to An unknown server-side error occurred while processing the command. Unable to launch WebDriverAgent because of xcodebuild failure: xcodebuild failed with code 65 From Dev InvalidOperationException: No authentication handler is registered for the scheme Bearer. build fails, with the message: Testing failed: WebDriverAgentRunner-Runner. npm ERR! missing script: start; Invariant Violation: Module AppRegistry is not a registered callable module; The session is unavailable because no secret key was set. /XXXXX. openqa. Creating a good mobile user experience is an art in itself, but is fortunately helped by the availability of various frameworks and libraries. Xcodebuild failed with code 65 · Issue #753 · facebookarchive , Why it is not deploying? I deploy the build through terminal (xcodebuild -project WebDriverAgent. Set the secret_key on the application to something unique and secret. selenium. 季文洪 · 2018年03月17日 · 最后由 古古阁 回复于 2018年11月13日 · 4978 次阅读 Unable to launch com. If you want to verify with a specific app, you can add an app path. bundle . I tried react-native on Button which is working fine. Let’s see the steps Enable fingerprint on android simulator Go to android settings | Security & Location | Fingerprint… Unable to launch WebDriverAgent because of xcodebuild failure: xcodebuild failed with code 65 重新在你的真机上编译WebDriverAgent 恒温 在 用 appium-desktop 进行 ios10 的真机测试,可以安装上我的 app,Inspector 为什么启动不起来 中提及了此贴 03月14日 10:43 How to resolve “Original error: Unable to launch WebDriverAgent because of xcodebuild failure: xcodebuild failed with code 65”? [closed] Environment: iOS version : 10. Unable to launch WebDriverAgent because of xcodebuild failure: xcodebuild failed with code 65 . and the paths are correct, try restarting Get Unable to launch WebDriverAgent because of xcodebuild failure: Command Make Sure you enable the 'Web Inspector' on the real device . If it cannot installed , check the connection , see if you can create and compile a “Hello World” with Xcode in the simulator. 18. 0 WebDriverAgent component only supports XCode9 and newer Sim Resetting. ) Delete your Firefox profile dir again > 5. swift', '~> 5. It is also possible that system security measures will prevent the server from being started, for example if the loopback interface has been disabled. If you must run a legacy application that installs an interactive service on Windows Server 2012, you may sacrifice server stability for compatibility by changing the following registry value from the default of "1" to "0". 74 Mh (Mega hashes) of hashing power. Original error: Unable to launch WebDriverAgent because of xcodebuild failure: xcodebuild failed with code 70 xcodebuild error message: (Selenium::WebDriver::Error::UnknownError) UnknownError: An unknown server-side error occurred while processing the command. exceptions. Note: Issue tracking for this repo has been disabled. CSDN问答为您找到Not able to start appium-desktop: "The file “WebDriverAgentRunner-Runner. 1. md. When you first start iTerm2, a window opens showing a terminal session. xcodeproj -scheme WebDriverAgentRunner -destination 'platform=iOS Simulator,name=iPhone 11' test This will check if WebDriverAgent can installed. test. debugserver" on device. If you already have a build module, xcodebuild can use it without additional building process. 一、Appium Desktop介绍 Appium Desktop是一款用于Mac、Windows和Linux的开源应用,内嵌了appium server和inspector的,更为优化的图形界面和appium 相关的工具的组合。 Well you’re in luck, because that error message probably indicates you already have Xcode installed on the Mac. Now start the appium server by entering the following into terminal appium If you’ve set everything up correctly, you should be able to right click on the myFirstTest method in AppTest. 2xlarge which do not adhere to the rules that we specified in the Guard Unable to capture the element in iOS devices in Appium Full screen is getting inspected. 1. If you start Xcode for the first time, a dialog will pop up where you can read the license agreement and accept it. path. e communication between Testsigma and Browser fails. Posted 5/31/20 10:45 PM, 7 messages Error: Unable to launch WebDriverAgent because of xcodebuild failure: xcodebuild failed with code 65 at XCUITestDriver. path. Defer() behaves differently and will now throw if multiple deferred operations on a document are pending on a session (e. 585 git checkout -b <update-branch-name> git submodule update --remote git add WebDriverAgent git commit -m "Updating upstream WebDriverAgent changes" There is a chance that the update changed something critical, which will manifest itself as xcodebuild throwing errors. Original error: Unable to launch WebDriverAgent because of xcodebuild failure: xcodebuild failed with code 65. shake is implemented via AppleScript and works only on Simulator due to lack of support from Apple [XCUITest] Shutting down xcodebuild process (pid 2713) [XCUITest] xcodebuild exited with code 'null' and signal 'SIGTERM' [XCUITest] Removing WDA application from device [XCUITest] Error: Unable to start WebDriverAgent session because of xcodebuild failure: A new session could not be created. A shortcut is to run sudo xcodebuild -license accept from the command line. quitAndUninstall$ (. hot 50 NoSuchDriverError: A session is either terminated or not started hot 43 [Xcode 12. Results: The app undet test installs WebDriverAgent install repeatidy WebDriverAgent uninstalls. Help. This is usually manifest by xcodebuild returning an error code 65. com [debug] [XCUITest] Waiting up to 60000ms for WebDriverAgent to start [XCUITest] xcodebuild exited with code '70' and signal 'null' [debug] [BaseDriver] Event 'wdaStartFailed' logged at 1491471554404 (15:09:14 GMT+0530 (IST)) [debug] [XCUITest] Unable to launch WebDriverAgent because of xcodebuild failure: xcodebuild failed with code 70 Encountered internal error running command: Error: Unable to launch WebDriverAgent because of xcodebuild failure: “xcodebuild failed with code 70” 1 'WebDriverAgent. TesterHome软件测试社区,人气最旺的软件测试技术门户,提供软件测试社区交流,测试沙龙。 I want to distribute my application. 669 xcodebuild[85849:748584] [MT] IDETestOperationsObserverDebug: Test runner for (null) will finish with error: Test session exited(82 There are situations you need to enable and use fingerprint security feature, but let’s say you are using android simulators, you can’t scan your finger, but simulator gives you an option to enable and use fingerprint. nano,t3. I want to customize Button so this made me to go for TouchableOpacity. " UserInfo={AuthorizationErrorCode [XCUITest] Unable to launch WebDriverAgent because of xcodebuild failure: Command '/bin/bash Scripts/bootstrap. hot 19 I am facing the error, "Neither ANDROID_HOME nor ANDROID_SDK_ROOT environment variable was exported" hot 17 Original error: Unable to start WebDriverAgent session because of xcodebuild failure: An unknown server-side error occurred while processing the command. Run with "Profile or Debug" for iOS Simulator. xcodeproj -scheme WebDriverAgentRunner -destination 'id=<udid>' test * 如果成功的话,会看到类似如下的输出: Test Suite 'All tests' started at 2017-01-23 15:49:12. framework&#39; was built for iOS + iOS Simulator. apple. hello to all i am new and i thank all the comments, i'm making a video game for xbox one s, i know that i use scorpio but i don't know how its ram works, i need to know what a graphics card is equivalent, and how many gb have, and i also believe that it also uses additional ram, because i want to be doing game with a pc with similar features to be closer to the final product. RestApiClient(version='6. realpath(__file__)) # Script file name & path to New: Added a simple TBasicArray RAII dynamic array type for low level code that can't use TArray because of its dependencies. dirname(os. stderr, "compiler_version. This test fails because the app nedds an authtenticated user to get his Identificator used in an Usecase. OrchPlay Format=app bundle with Mach-O thin (x86_64) CodeDirectory v=20500 size=1134854 flags=0x10000(runtime) hashes=35455+5 location=embedded Signature size=4755 Authority=Developer ID Application: Baptiste xxxxx (62CS2SG5TM) Authority=Developer ID Ios simulator build. Like selenium WebDriver locators, we have locators in AndroidDriver for android & iOSDriver for iOS, both extending the AppiumDriver for mobile app automation. Most probable reason for this error is an outdated Selenium Browser driver may lead to this. To automate the apps on real iPhone, you will have to take below steps Find the udid of real iphone using command "instruments -s devices". err:service:service_send_start_message service L"GorillaPrice" failed to start fixme:service:scmdatabase_autostart_services Auto-start service L"GorillaPrice" failed to start: 1053 Dynamic session lookup supported but failed: launchd did not provide a socket path, verify that org. Fix “iTunes sync session failed to start” with just one click. 0. /. a delete followed by a store) Formatting of document Ids in exception messages has changed to all lowercase, even when the document id itself has a MixedCase prefix. Steps: 1. 7. [Xcode] ** TEST EXECUTE FAILED ** [XCUITest] xcodebuild exited with code '65' and signal 'null' [debug] [XCUITest] Unable to launch WebDriverAgent because of xcodebuild failure: xcodebuild failed with code 65 [debug] [XCUITest] Quitting and uninstalling WebDriverAgent, then retrying [XCUITest] Shutting down sub-processes Error: Unable to launch WebDriverAgent because of xcodebuild failure: "xcodebuild failed with code 65" Solution. 1) ===== #### General - fix several internal Appium tests - add a sendKeyStrategy capability to allow testers to enable less reliable, but faster sendKey method - add handling for safeRimRafSync ENOENT mesages - clean up sessions when session clobbering enabled - fix stripping log colors on --stripColors Original error: Unable to launch appium 启动ios,报错 No "iOS Development" signing certificate matching team ID "xxxxx" with a private key was found - 绝世老中医 - 博客园 首页 xcodebuild -project WebDriverAgent. apple. xcodeproj -scheme WebDriverAgentRunner - Xcode complains that a method of some class doesn’t exist. Appium users have the question like how to speed up the iOS tests, citing the length of time it takes to start tests which use the WebDriverAgent library (all tests using the XCUITest driver). V009. I am trying to setup react native navigation like below which is not working now. Original error: Could not proxy command to remote server. Please make sure the device under test can connect to Xcode without issues. /. Encountered internal error running command: Error: Unable to launch WebDriverAgent because of xcodebuild failure: "xcodebuild failed with code 65". 修改appium中的webdriveragent工程路径 MacPorts is an easy to use system for compiling, installing, and managing open source software. mkdir -p Resources/WebDriverAgent. Domain: com. 3 (from 1. WebDriverException: Message: An unknown server-side error occurred while processing the command. Followed the Steps provided in log by uninstalling the app and web Environment. Also ensure that you accept the license once installed, you can execute following command to accept Xcode license terms sudo xcodebuild -license Installation failures may also occur if you’re using an older version of PIP, in this case, you can either temporarily move your older version of PIP onto a different location until JuliaPro appium-xcuitest-driver. Appium Desktop介绍-xcodebuild failed with code 65 问题解决. xcodeproj; Select WebDriverAgentLib, and in the Signing section, check Automatically manage to sign and select a team. As you can see, my mining power on my 2018 MacBook resulted in 13. I have a problem as you see like Failed to start remote service "com. 0 is a minor release General Add score attribute for ImageElement appium-base-driver#396 Add a route to be… Now add all the desired capabilities required to start the session. app If the xcode-select command 我们正在尝试启动一个WebDriverAgent并且它在下一步(日志提取)中陷入困境: [MJSONWP] Encountered internal error running command: Error Trying to compile a build of iTerm to implement some changes I'm interested in. g. Build WebDriverAgent to verify whether the steps above works or not I have been trying repeatedly to install the student version of autocad 2013, and every time it starts the install stalls at "installing akamai netsession interface" and gives me a pop up box saying "network failure". Make sure you follow the tutorial at https://github 重新启动appium server,然后再启动start new session . 2. Appium version (or git revision) that exhibits the Unable to start WebDriverAgent session because of xcodebuild failure: An unknown server-side error occurred while processing the command. . If I remove the "app" from capablities then I get following error selenium. Most of the perceived speed of an Appium test can’t be improved due to the base speed of booting devices or the UI actions themselves. R may indicate inadequate resource limits (see Running R). 运行时提示Unable to launch WebDriverAgent because of xcodebuild failure:xcodebuild failed with code 65 解决方法:1开发者账号:使用AppiumDesktop启动AppiumAppiumDesktop中加入 xcodeOrgId 和xcodeSigningId 字段TeamI Tour Start here for a quick overview of the site Unable to launch WebDriverAgent because of xcodebuild failure: Unable to connect to host 127. /lib/driver. Original error: Unable to start WebDriverAgent session because of xcodebuild failure: An unknown server-side error occurred while processing the command. 0') # Endpoints used in this sample scripts_endpoint = 'analytics/custom_actions/scripts' actions_endpoint = 'analytics/custom_actions/actions' # Variable to hold the root path to the custom actions sample folder root_path = os. If this attribute is not set, it defaults to the file ". Original error: Error: read ECONNRESET #10401 An unknown server-side error occurred while processing the command. Continuous Integration. I set the appium gui app to launch the android virtual device whenever I click the 'launch General Usage Tabs. in this article, we will look into how to run selenium tests using maven build in eclipse. WebDriverAgentRunner-Runner'}}} Hi @santwana. : Failed to launch process with bundle identifier 'com. Please try again later”. js:315:22) at Error: Unable to start WebDriverAgent session because of xcodebuild failure: "Could not proxy command to remote server. It might also tell you that the system was unable to unlock your login keychain. 00/ 0. 17. 00 sxcodebuild: error: Unable to find a destination matching the provided destination specifier: { platform:iOS, id:00008020-001514A03E99002E } The requested device could not be found because no available devices matched the request. Any one resolved this? If anyone is also facing same issue, please add your findings in comments. setCapability(“app”, “com. xcodeproj -scheme WebDriverAgentRunner -destination ‘id=’ Now you are ready to start the automation using XCUITest framework for iOS 9. stderr, "compiler_version. path. If your steps are continuously failing because of the dynamic attributes in your page recorded using Testsigma Recorder, you have an option to exclude those values from getting added to the UI Identifiers. /Scripts/bootstrap. 0 t = 0. Problem: Unable to start session after selecting an application in MOS or Mobile recorder on Xcode version 11. Original error: Unable to launch WebDriverAgent because of xcodebui Unable to launch the IIS Express Web server 问题之解决 - [Visual Studio 2015] 背景:Visual Studio 2015 在 Debug 模式下调试失败。 Get all of Hollywood. js:352:21). tensorflow. sh -d Open WebDriverAgent. OrchPlay Format=app bundle with Mach-O thin (x86_64) CodeDirectory v=20500 size=1134854 flags=0x10000(runtime) hashes=35455+5 location=embedded Signature size=4755 Authority=Developer ID Application: Baptiste xxxxx (62CS2SG5TM) Authority=Developer ID 重新启动appium server,然后再启动start new session . Install using `brew install carthage` if it is not installed and make sure the root folder, where carthage binary is installed, is present in PATH environment variable By setting the team, the errors showing up for WebDriverAgentRunner should disappear. even installed appium self. js:386:15) at tryCatch (/usr/local/lib/node_modules/appium/node_modules/babel-runtime/regenerator/runtime. NOTE: Place the Eclipse IDE and jar files under a fixed folder location, do not change the folder path once you start writing the selenium tests. To lower the RAM size, run the IntelHaxm. git checkout -b <update-branch-name> git submodule update --remote git add WebDriverAgent git commit -m "Updating upstream WebDriverAgent changes" There is a chance that the update changed something critical, which will manifest itself as xcodebuild throwing errors. 4s. После нажатия на Start session Запускается симулятор девайса, устанавливается приложение и Appium сообщает в окне вот такую ошибку [0-1] 2020-04-01T17:34:21. framework. MacMiner starting a miner Six years ago, you would have been able to mine more than 100 BTC on your GPU. WebDriverAgentRunner-Runner because it has an invalid code signature, inadequate entitlements or its profile has not been explicitly trusted by the user. Make sure you follow the tutorial at https://github. com's best TV lists, news, and more. Luckily, this is pretty easy to accomplish, as Core Image has a simple way to handle Raw images. Unable to launch WebDriverAgent because of xcodebuild failure: xcodebuild failed with code 65 From Dev InvalidOperationException: No authentication handler is registered for the scheme Bearer. The command is xcodebuild test-without-build. test. Make sure you follow the tutorial at https://githu Original error: Unable to launch WebDriverAgent because of xcodebuild failure: Command 'carthage bootstrap --platform iOS\,tvOS' exited with code 1 i have installed carthage again and did everything but no luck. codesign -dvv returns Identifier=com. 5; [ Natty ] python Python sum of ASCII values of all characters in a string By: Aditya Karan 0. 0 WebDriverAgent component only supports XCode8 and newer Since module version 2. If you don't know your old password If you don't know your old password, the solution is to create a new login keychain. 0-beta. 成功之后启动appium ,start inspector session,startSession。 Unable to launch WebDriverAgent because of xcodebuild failure: "xcodebuild failed with code 65". Original error: Unable to launch WebDriverAgent because of xcodebuild failure: xcodebuild failed with code 65. start) is used. test. However, running the ‘xcodebuild’ command in terminal or android studio results in missing modules for any native pods. xcodebuild -project WebDriverAgent. Prerequisite is an active Apple Developer Profile and your Xcode linked to this profile. Desktop Director shows it as a Machine Failure, and upon looking at the details, it shows that the user's session state is still active. xcodebuild error message: . Analysis of 'Makefile/Utility' type projects is not supported in this tool. debugserver" on device. CodePipeline should be in a failed state because your CodeCommit repository is empty initially. 修改 webdriveragent 遇到的问题汇总如下. common. xcodeproj in Xcode. 刚刚装的eclipse,想运行一个简单的helloworld程序,居然跳出来这个unable to launch:The selection can not be launched,and there are no recent launches. 3. xcodebuild -project WebDriverAgent. stderr, e: 204: return "" 205: 206 +def GetVersionFromEnvironment(compiler_env): 207 + """ Returns the version of compiler: 208 + 209 + If the compiler was set by the given environment variable and exists, 210 + return its version, otherwise None is Unable to launch com. That's because your login keychain is still using your old password. Super easy to use and don't need to master iTunes technical knowledge for you. CSDN问答为您找到Unable to build OpenCorePkg RELEASE from source but building DEBUG works相关问题答案,如果想了解更多关于Unable to build OpenCorePkg RELEASE from source but building DEBUG works技术问题等相关问答,请访问CSDN问答。 Troubleshooting, If you see iOS Simulator failed to install the application. exe again and choose change. RestApiClient(version='6. dll', ErrorCode = '0x8000 Linux serial read blocks minicom Julia passing arguments, reading the command line CHANGES IN VERSION 1. 96. 11:24:36. This issue can occur if there are more than 65,000 files in the Windows Temp directory. New: Added support for SetThreadDescription thread naming API. 9 onward, if Xcode is already installed in Mac OS X then Command Line Tools becomes installed as well (you can check this by trying to run gcc or make from the terminal). In Xcode, the Configurations section of your project's Info pane provides a pop-up menu, which sets the default configuration to be used by xcodebuild when building a target. apple. To solve this issue, stop the Open Agent and change the device settings to no longer lock the screen. The following commands should do the trick: Typically, Appium uses xcodebuild under the hood to both build WebDriverAgent and kick off the XCUITest process that powers the test session. md. Firstly, xcodebuild isn’t really working well doing testing unless you run it logged on as yourself, I suggest running it in a Terminal session. unable to start webdriveragent session because of xcodebuild failure

<
<
bm3-powerbuilding">
Unable to start webdriveragent session because of xcodebuild failure